{"text_format":"1","workbook":"xlsx","n_sheets":5,"sheets":["Guide for LAs","Input form EXAMPLE","Input form","Plan output","Do not change - workings"],"not_rendered":{"charts":4,"images":4,"macros":1,"external_links":1,"defined_names":6,"comments":0,"pivot_tables":0},"unopened":[],"bounds":{"document_bytes":16777216,"sheet_cells":100000,"rows_first":2000,"rows_last":500,"rows_between":2000,"halvings":0,"cell_chars":16384,"cell_head_chars":4096},"cells_cut":0,"cells_raw":0,"read":"whole","date_system":"1900"}

{"sheet":"Guide for LAs","index":0,"n_rows":72,"n_cols":3,"rows_kept":72,"cut":false,"hidden":true,"merged":[[38,2,38,3],[14,1,15,2],[29,1,29,2],[6,1,6,2],[30,1,30,2],[32,1,32,2],[10,1,10,2],[17,1,17,2],[20,1,20,2],[64,1,64,2],[65,1,65,2],[1,1,1,2],[56,1,56,2],[61,1,61,2],[3,1,3,2],[4,1,4,2],[8,1,8,2],[9,1,9,2],[12,1,12,2],[28,1,28,2],[31,1,31,2],[36,1,36,2],[37,1,37,2],[39,1,39,2],[58,1,58,2]]}
[]
[null,"How to complete the template (guidance for local authorities)"]
[]
[null,"Which projects do I enter information about?"]
[null,"The template is for local authorities to show local groups how they plan to invest in capital projects to get good outcomes for pupils with education, health and care (EHC) plans for their special educational need or disability."]
[]
[null,"The template should include: "]
[]
[null,"All capital projects at a range of provision including mainstream and special schools designed to create new (additional) places, build new facilities or improve existing facilities to benefit pupils with EHC plans. This includes investment in mainstream and special provision for children and young people aged 0-25. "]
[null,"This must include capital projects funded fully or partially through the special provision fund allocation "]
[null,"This may include expenditure on capital projects funded via other funding (where applicable) up until the financial year 2020/21."]
[]
[null,"The template should not include whole new centrally-funded free schools. Money from the special provision capital fund cannot be spent on revenue (i.e. staffing costs and training) and revenue expenditure should not be included on the form. "]
[]
[null,"The local authority should not enter costings for any project where this constitutes commercially sensitive information, for example, if contracts have not yet been tendered. The local authority may choose to set out indicative costings and mark this in the comments box. Where all costs are not entered when the plan is first published the local authority should republish the plan once costs can be included."]
[]
[]
[null,"There are two forms to complete on the 'input form' tab"]
[null,"1. Project information form","Complete this for each project"]
[null,"2. Consultation form","Complete this for each group you have consulted about any of the projects. This table must include information about how you have consulted parents and carers."]
{"$rows_left_out":53}
{"sheet":"Input form EXAMPLE","index":1,"n_rows":22,"n_cols":16,"rows_kept":22,"cut":false,"hidden":false,"merged":[[0,1,0,5],[1,1,1,11],[1,14,1,15],[3,1,3,3],[3,4,3,7],[3,9,3,10],[3,11,3,12],[20,1,20,12],[21,1,21,2],[21,3,21,4],[5,1,5,3],[5,4,5,5],[5,7,5,10],[5,11,5,12],[6,1,6,3],[6,4,6,5],[6,7,6,10],[6,11,6,12],[6,14,6,15],[8,1,8,8],[8,9,8,12],[10,1,10,12],[11,1,11,5],[11,6,11,7],[11,8,11,10],[11,11,11,12],[11,14,11,15],[21,5,21,12],[21,14,21,15],[23,1,23,2],[23,3,23,4],[23,5,23,12],[23,13,23,15],[22,1,22,2],[22,3,22,4],[22,5,22,12],[22,13,22,15],[24,1,24,2],[24,3,24,4],[24,5,24,12],[24,13,24,15],[25,1,25,2],[25,3,25,4],[25,5,25,12],[25,13,25,15],[28,1,28,2],[28,3,28,4],[28,5,28,12],[28,13,28,15],[26,1,26,2],[26,3,26,4],[26,5,26,12],[26,13,26,15],[27,1,27,2],[27,3,27,4],[27,5,27,12],[27,13,27,15]]}
[null,"Special provision plan "]
[null,"Input form for Local Authority to complete"]
[]
[null,"Local authority",null,null,"Wirral",null,null,null,null,"Date of last update",null,"2018-04-25"]
[]
[null,"Local authority's special provision fund allocation",null,null,500000,null,null,"Total planned expenditure on projects: special provision fund ",null,null,null,500000]
[null,"Other investment the local authority plans to make in SEND capital up until 2021",null,null,"£xx,xxx",null,null,"Total planned expenditure on projects: other funding up until 2021"]
[]
[null,"The local authority is required to consult parents and carers to receive their allocation. Local authorities should use the box to the right to confirm that they have consulted with parents and carers about their plan and projects and complete the 'Consultation form' below.\n",null,null,null,null,null,null,null,"The local authority is or will be consulting parents and carers and will republish this plan before receiving their allocation"]
[]
[null,"Project information form"]
[null,"Provision",null,null,null,null,"Investment in additional places (£)",null,"Number of additional places",null,null,"Investment in facilities (£)",null,"Total (£)","Additional Information about each project"]
[null,"Provision  URN","Provision name and address","Provision category","Ofsted Judgement","Age range for project","Special provision fund investment in additional places","Other investment in additional places","Special provision fund additional planned places","Other investment additional planend places","Total additional planned places","Special provision fund investment in facilities","Other investment in facilities","Total investment in project","Type of SEN or disability that project is designed to meet.  ","LAs should use this section of the table to set out more details about the aims of the project. Beyond this further information can be listed in their strategic plan or directly on their local offer page. "]
[null,"TBC","Reserved for capital outcomes of the SEN Strategic Review.","Other",null,null,null,null,null,null,{"$f":"SUM('[1]Input form'!$I14:$J14)","v":0},500000,null,500000,"To be determined","Allocation of the18/19, 19/20 and 20/21 funding stream will be decided once the external review of provision has been completed. Full consultation will take place before the money is allocated. A full update will be published once the externnal review is completed."]
[]
[]
[]
[null,null,null,null,null,null,null,null,null,null,{"$f":"SUM(InputForm3[[#This Row],[Special provision fund additional planned places]:[Other investment additional planend places]])","v":0},null,null,{"$f":"SUM(G18:H18,L18:M18)","v":0}]
[]
[]
{"$rows_left_out":3}
{"sheet":"Input form","index":2,"n_rows":28,"n_cols":16,"rows_kept":28,"cut":false,"hidden":true,"merged":[[0,1,0,5],[25,5,25,12],[26,5,26,12],[27,5,27,12],[24,5,24,12],[22,1,22,2],[22,3,22,4],[23,1,23,2],[23,3,23,4],[23,5,23,12],[24,1,24,2],[24,3,24,4],[25,1,25,2],[25,3,25,4],[26,1,26,2],[26,3,26,4],[22,5,22,12],[28,1,28,2],[28,3,28,4],[28,5,28,12],[27,1,27,2],[27,3,27,4],[6,14,6,15],[5,11,5,12],[11,14,11,15],[11,11,11,12],[11,6,11,7],[11,8,11,10],[1,14,1,15],[3,9,3,10],[3,11,3,12],[1,1,1,11],[3,1,3,3],[3,4,3,7],[6,1,6,3],[6,11,6,12],[5,4,5,5],[6,4,6,5],[5,7,5,10],[6,7,6,10],[5,1,5,3],[25,13,25,15],[26,13,26,15],[27,13,27,15],[28,13,28,15],[8,1,8,8],[8,9,8,12],[20,1,20,12],[10,1,10,12],[21,14,21,15],[21,5,21,12],[11,1,11,5],[21,1,21,2],[21,3,21,4],[22,13,22,15],[23,13,23,15],[24,13,24,15]]}
[null,"Special provision plan "]
[null,"Imput form for Local Authority to complete"]
[]
[null,"Local authority",null,null,"Example LA",null,null,null,null,"Date of last update"]
[]
[null,"Local authority's special provision fund allocation",null,null,{"$f":"INDEX('Do not change - workings'!V:V,MATCH(E4,'Do not change - workings'!R:R, 0))","v":995000},null,null,"Total planned expenditure on projects: special provision fund ",null,null,null,{"$f":"SUM(InputForm[Special provision fund investment in additional places],InputForm[Special provision fund investment in facilities])","v":995000}]
[null,"Other investment the local authority plans to make in SEND capital up until 2021",null,null,95000,null,null,"Total planned expenditure on projects: other funding up until 2021",null,null,null,{"$f":"SUM(InputForm[Other investment in additional places],InputForm[Other investment in facilities])","v":95000},null,null,{"$f":"IF(L7>E7,\"Error: Exceeded funding: Other investment columns J and M should not exceed total amount in cell F7\",\"\")","v":""}]
[]
[null,"The local authority is required to consult parents and carers to receive their allocation. Local authorities should use the box to the right to confirm that they have consulted with parents and carers about their plan and projects and complete the 'Consultation form' below.\n",null,null,null,null,null,null,null,"Confirm either that the LA has or will be consulting parents and carers"]
[]
[null,"Project information form"]
[null,"Provision",null,null,null,null,"Investment in additional places (£)",null,"Number of additional places",null,null,"Investment in facilities (£)",null,"Total (£)","Additional Information about each project"]
[null,"Provision  URN","Provision name and address","Provision category","Ofsted Judgement","Age range for project","Special provision fund investment in additional places","Other investment in additional places","Special provision fund additional planned places","Other investment additional planend places","Total additional planned places","Special provision fund investment in facilities","Other investment in facilities","Total investment in project","Type of SEN or disability that project is designed to meet.  ","LAs should use this section of the table to set out more details about the aims of the project. Beyond this further information can be listed in their strategic plan or directly on their local offer page. "]
[null,131313,"Example school A, Town road, Local Authority A","Special provision","Outstanding","Primary, secondary and post-16",280000,0,4,0,{"$f":"SUM(InputForm[[#This Row],[Special provision fund additional planned places]:[Other investment additional planend places]])","v":4},0,0,{"$f":"SUM(G14:H14,L14:M14)","v":280000},"Multiple and complex learning difficulties. The school is designed to meet a wide range of needs. ","Expansion to outstanding special school. The investment is part of a wider package of investment to to reduce children's travel times to other local authorities and support them to be independent in their own community. Improved facilities such as expanding two class-rooms to enable pupils to move around the class-room independently and allow the teacher and teaching assistants sufficient space to facilitate group work. Work will take place over the summer of 2018. More details on the LAs website at: www.LAwebsite.gov.uk/education_plans. "]
[null,232323,"Example school B, School Lane, Local Authority A","Mainstream provision (not unit)","Good","Secondary",360000,0,10,0,{"$f":"SUM(InputForm[[#This Row],[Special provision fund additional planned places]:[Other investment additional planend places]])","v":10},50000,20000,430000,"Emotional, social and mental health difficulties","Part of a project to create new places and add new facilities including calm rooms to support better mental health and wellbeing for pupils with EHC plans for emotional, social and mental health difficulties. These spaces are needed so that teachers and teaching assistants have a seperate space to talk to pupils seperate from the classroom. More details including timings on the LAs website at: www.LAwebsite.gov.uk/education_plans . "]
[null,343414,"Example school C, Country Road, Local Authority A","Special unit or resourced provision","Not yet inspected","Secondary and post-16",170000,50000,4,2,{"$f":"SUM(InputForm[[#This Row],[Special provision fund additional planned places]:[Other investment additional planend places]])","v":6},80000,0,300000,"Autism including Asperger's syndrome","Expansion to special unit at a mainstream school due to high parental demand and need for new places in this LA and neighbouring LAs x and y. Facilities improvement involves enlargements to a space that will be turned into a learning kitchen to help pupils with special educational needs and disabilties at the school learn cooking skills to support independent living. Work will take place in two stages in late 2018 More details on the LAs website at: www.LAwebsite.gov.uk/education_plans. "]
[null,232323,"Example school D, Mill Road, Local authority A","Mainstream provision (not unit)","Not inspected by Ofsted","Secondary and post-16",0,0,0,0,{"$f":"SUM(InputForm[[#This Row],[Special provision fund additional planned places]:[Other investment additional planend places]])","v":0},55000,25000,80000,"This school is designed to meet the needs of those with a wide range of disabilities and SEN. The purpose of the extension is to meet emotional, social and mental health challenges. ","Facilities' improvements to a sixth-form college to better meet the needs of current and future pupils. This includes expanding classrooms in the that are unsuitable for non-ambulant pupils due to the size. The college is keen to promote inclusion. This is part of an overall programme where the college aims to include more pupils with SEN and disabilities. Enlarging the classroom would allow the teacher to run more workshops including with non-ambulant pupils working together in groups. More details on the LAs website at: www.LAwebsite.gov.uk/education_plans. \n"]
[null,null,null,null,null,null,null,null,null,null,{"$f":"SUM(InputForm[[#This Row],[Special provision fund additional planned places]:[Other investment additional planend places]])","v":0},null,null,{"$f":"SUM(G18:H18,L18:M18)","v":0}]
[]
[]
{"$rows_left_out":9}
{"sheet":"Plan output","index":3,"n_rows":12,"n_cols":10,"rows_kept":12,"cut":false,"hidden":false,"merged":[[0,1,0,9],[29,1,30,9],[8,1,9,1],[5,1,6,1],[11,1,11,9],[5,2,6,5],[8,2,9,5],[2,1,3,4]]}
[null,{"$f":"'Input form'!E4","v":"Example LA"}]
[]
[null,"Special provision fund capital plan",null,null,null,null,"Total planned investment in additional places","£xxx,xxx","Total planned investment to improve existing schools' facilities","£xxx,xxx"]
[null,null,null,null,null,null,"Total planned number of additional places","xx","Total planned number of improvement projects","x"]
[]
[null,"Special provision fund allocation","£xxx,xxx",null,null,null,"£s investment for planned additional places","£xxx,xxx","£s investment in facilities","£xxx,xxx"]
[null,null,null,null,null,null,"No. of additional places planned","xx","No. of facilities improvement projects","x"]
[]
[null,"Other funding\n other than the SEND capital allocation (where applicable)","£xx,xxx",null,null,null,"£s investment for planned additional places","£xx,xxx","£s investment in facilities ","£xx,xxx"]
[null,null,null,null,null,null,"No. of additional places planned","x","No. of facilities improvement projects","x"]
[]
[null,"More information about investment in provision for pupils with education, health and care (EHC) plans up until 2021"]

{"sheet":"Do not change - workings","index":4,"n_rows":159,"n_cols":25,"rows_kept":159,"cut":false,"hidden":true,"merged":[[19,2,19,3],[8,2,8,3],[4,5,4,7],[5,5,5,7],[8,7,8,8],[19,7,19,8],[19,4,19,6],[8,4,8,6],[0,18,0,21],[1,5,1,8],[1,16,1,21],[2,16,2,21],[3,16,3,21]]}
[null,"Spreadsheet workings",null,null,null,null,null,null,null,null,null,"Provision",null,null,null,null,null,"Allocations ","Copied from https://www.gov.uk/government/publications/send-provision-capital-funding-for-pupils-with-ehc-plans at 20 March 2017"]
[null,"Local authority:",null,null,null,{"$f":"'Input form'!E4","v":"Example LA"},null,null,null,null,null,null,null,null,null,null," Special provision fund: Allocation for local authorities from 2018/19 to 2020/21"]
[null,{"$f":"F2","v":"Example LA"},null,null,null,null,null,null,null,null,null,"Spreadsheet workings: Codes",null,null,null,null,"Published March 2017"]
[null,null,null,null,null,null,null,null,null,null,null,"Lists of categories",null,null,null,null,"Published March 2017",null,null,null,null,null,null,null,"Consultation"]
[null,"Local authority's special provision fund allocation",null,null,null,{"$f":"INDEX(V:V,MATCH(F2,R:R, 0))","v":995000},null,null,null,null,null,"Groups to select from","Sub-groups",null,"Ofsted inspection judgment",null,"LA Number","Local Authority name"," 2018/19","2019/20"," 2020/21","LAs total allocation",null,null,"The local authority has consulted parents and carers"]
[null,"Other investment the local authority plans to make in SEND capital",null,null,null,{"$f":"SUM('Input form'!H14:H18)+SUM('Input form'!M14:M18)","v":95000},null,null,null,null,null,"Provision category","Provision type",null,"Outstanding",null,null,null,null,null,null,null,null,null,"The local authority is or will be consulting parents and carers and will republish this plan before receiving their allocation"]
[null,null,null,null,null,null,null,null,null,null,null,"Alternative provision/PRU","Academy (or free school) Alternative provision",null,"Good",null,null,"Totals",71666666.666666612,71666666.666666612,71666666.666666612,215000000.00000003,null,null,"Confirm either that the LA has or will be consulting parents and carers"]
[null,"Investment by quality",null,null,null,null,null,null,null,null,null,null,"Pupil referral unit (LA maintained)",null,"Requires Improvement",null,null,"SELECT LOCAL AUTHORITY"]
[null,null,"Investment in new places",null,"Investment in facilities improvements",null,null,"No. of places created from:",null,"Places",null,"Independent and non-maintained","Independent school",null,"Inadequate",null,301,"Barking and Dagenham",945715.60472154047,945715.60472154047,945715.60472154047,2837146.8141646213,null,null,"Limits set on cells"]
[null,"Quality (Ofsted rating)","Special provision fund","Other investment","Special provision fund","Other investment","Total investment","Special provision fund","Other investment","Total no. new places planned",null,null,"Non-Maintained Special School",null,"Not yet inspected",null,302,"Barnet",1001778.2807387415,1001778.2807387415,1001778.2807387415,3005334.8422162244,null,null,"Input form, project information form: rows I and J have an entry limit of 200 places "]
[null,"outstanding",{"$f":"SUMIF(InputForm[Ofsted Judgement],$B11,InputForm[Special provision fund investment in additional places])","v":280000},{"$f":"SUMIF(InputForm[Ofsted Judgement],$B11,InputForm[Other investment in additional places])","v":0},{"$f":"SUMIF(InputForm[Ofsted Judgement],$B11,InputForm[Special provision fund investment in facilities])","v":0},{"$f":"SUMIF(InputForm[Ofsted Judgement],$B11,InputForm[Other investment in facilities])","v":0},{"$f":"SUM(E11:F11)","v":0},{"$f":"SUMIF(InputForm[Ofsted Judgement],$B11,InputForm[Special provision fund additional planned places])","v":4},{"$f":"SUMIF(InputForm[Ofsted Judgement],$B11,InputForm[Other investment additional planend places])","v":0},{"$f":"SUM(H11:I11)","v":4},null,null,"Other independent special school",null,"Not inspected by Ofsted",null,370,"Barnsley",260425.45359040017,260425.45359040017,260425.45359040017,781276.3607712005,null,null,"Input form, project information form: row L has an expenditure limit of the selected special provision fund allocation i.e. the LA cannot invest more special provision fund money that it will receive"]
[null,"good",{"$f":"SUMIF(InputForm[Ofsted Judgement],$B12,InputForm[Special provision fund investment in additional places])","v":360000},{"$f":"SUMIF(InputForm[Ofsted Judgement],$B12,InputForm[Other investment in additional places])","v":0},{"$f":"SUMIF(InputForm[Ofsted Judgement],$B12,InputForm[Special provision fund investment in facilities])","v":50000},{"$f":"SUMIF(InputForm[Ofsted Judgement],$B12,InputForm[Other investment in facilities])","v":20000},70000,{"$f":"SUMIF(InputForm[Ofsted Judgement],$B12,InputForm[Special provision fund additional planned places])","v":10},{"$f":"SUMIF(InputForm[Ofsted Judgement],$B12,InputForm[Other investment additional planend places])","v":0},{"$f":"SUM(H12:I12)","v":10},null,"Mainstream provision (not unit)","Academy (or free school) 16-19 (mainstream)",null,null,null,800,"Bath and North East Somerset",192331.3817330109,192331.3817330109,192331.3817330109,576994.14519903273,null,null,"Input form, project information form: row J has an expenditure limit of the entered figure for other investment i.e. the LA cannot type that they will invest more in one project than the total sum of their expenditure"]
[null,"requires improvement",{"$f":"SUMIF(InputForm[Ofsted Judgement],$B13,InputForm[Special provision fund investment in additional places])","v":0},{"$f":"SUMIF(InputForm[Ofsted Judgement],$B13,InputForm[Other investment in additional places])","v":0},{"$f":"SUMIF(InputForm[Ofsted Judgement],$B13,InputForm[Special provision fund investment in facilities])","v":0},{"$f":"SUMIF(InputForm[Ofsted Judgement],$B13,InputForm[Other investment in facilities])","v":0},0,{"$f":"SUMIF(InputForm[Ofsted Judgement],$B13,InputForm[Special provision fund additional planned places])","v":0},{"$f":"SUMIF(InputForm[Ofsted Judgement],$B13,InputForm[Other investment additional planend places])","v":0},0,null,null,"Academy or free school (mainstream)",null,null,null,822,"Bedford",309620.24264860078,309620.24264860078,309620.24264860078,928860.72794580227,null,null,"Input form, L7: Conditional formatting if rows  "]
[null,"inadequate",{"$f":"SUMIF(InputForm[Ofsted Judgement],$B14,InputForm[Special provision fund investment in additional places])","v":0},{"$f":"SUMIF(InputForm[Ofsted Judgement],$B14,InputForm[Other investment in additional places])","v":0},{"$f":"SUMIF(InputForm[Ofsted Judgement],$B14,InputForm[Special provision fund investment in facilities])","v":0},{"$f":"SUMIF(InputForm[Ofsted Judgement],$B14,InputForm[Other investment in facilities])","v":0},0,{"$f":"SUMIF(InputForm[Ofsted Judgement],$B14,InputForm[Special provision fund additional planned places])","v":0},{"$f":"SUMIF(InputForm[Ofsted Judgement],$B14,InputForm[Other investment additional planend places])","v":0},0,null,null,"Maintained school (including community, foundation school)",null,null,null,303,"Bexley",684008.23847433401,684008.23847433401,684008.23847433401,2052024.7154230019,null,null,"Input form, project information form: Word limits of 200 characters to row O"]
[null,"not yet inspected",{"$f":"SUMIF(InputForm[Ofsted Judgement],$B15,InputForm[Special provision fund investment in additional places])","v":170000},{"$f":"SUMIF(InputForm[Ofsted Judgement],$B15,InputForm[Other investment in additional places])","v":50000},{"$f":"SUMIF(InputForm[Ofsted Judgement],$B15,InputForm[Special provision fund investment in facilities])","v":80000},{"$f":"SUMIF(InputForm[Ofsted Judgement],$B15,InputForm[Other investment in facilities])","v":0},80000,{"$f":"SUMIF(InputForm[Ofsted Judgement],$B15,InputForm[Special provision fund additional planned places])","v":4},{"$f":"SUMIF(InputForm[Ofsted Judgement],$B15,InputForm[Other investment additional planend places])","v":2},6,null,null,"LA nursery school",null,null,null,330,"Birmingham",1423958.4906547957,1423958.4906547957,1423958.4906547957,4271875.4719643872,null,null,"Input form, project information form: Word limits of 600 characters to row P"]
[null,"not inspected by Ofsted",{"$f":"SUMIF(InputForm[Ofsted Judgement],$B16,InputForm[Special provision fund investment in additional places])","v":0},{"$f":"SUMIF(InputForm[Ofsted Judgement],$B16,InputForm[Other investment in additional places])","v":0},{"$f":"SUMIF(InputForm[Ofsted Judgement],$B16,InputForm[Special provision fund investment in facilities])","v":55000},{"$f":"SUMIF(InputForm[Ofsted Judgement],$B16,InputForm[Other investment in facilities])","v":25000},80000,{"$f":"SUMIF(InputForm[Ofsted Judgement],$B16,InputForm[Special provision fund additional planned places])","v":0},{"$f":"SUMIF(InputForm[Ofsted Judgement],$B16,InputForm[Other investment additional planend places])","v":0},0,null,null,"Studio school",null,null,null,889,"Blackburn with Darwen",166666.66666666666,166666.66666666666,166666.66666666666,500000,null,null,"Input form, consultation form: Word limits of 200 characters to row B"]
[null,"Total",{"$f":"SUM(C11:C16)","v":810000},50000,185000,45000,230000,18,2,20,null,null,"University technical college",null,null,null,890,"Blackpool",166666.66666666666,166666.66666666666,166666.66666666666,500000,null,null,"Input form, consultation form: Word limits of 200 characters to row D"]
[null,null,null,null,null,null,null,null,null,null,null,"Special provision","Academy (or free school) special",null,null,null,350,"Bolton",275943.48410222004,275943.48410222004,275943.48410222004,827830.45230666013,null,null,"Input form, consultation form: Word limits of 600 characters to row F"]
[null,"Investment by provision type",null,null,null,null,null,null,null,null,null,null,"Maintained special school (including community and foundations schools)",null,null,null,837,"Bournemouth",317883.4213599193,317883.4213599193,317883.4213599193,953650.26407975785,null,null,"Input form, consultation form: Word limits of 600 characters to row N"]
[null,null,"Investment in new places",null,"Investment in facilities improvements",null,null,"No. of places created from:",null,"Places",null,"Special unit or resourced provision","Special unit/ resourced provision at academy",null,null,null,867,"Bracknell Forest",250926.93217750743,250926.93217750743,250926.93217750743,752780.7965325223]
{"$rows_left_out":139}